Target
Phosphatidylinositol 4,5-bisphosphate 3-kinase catalytic subunit alpha isoform
Ligand
BDBM50091695
Substrate
Meas. Tech.
ChEMBL_1498376 (CHEMBL3584205)
IC50
6.5±n/a nM
Citation
 Yang, HMedeiros, PFRaha, KElkins, PLind, KELehr, RAdams, NDBurgess, JLSchmidt, SJKnight, SDAuger, KRSchaber, MDFranklin, GJDing, YDeLorey, JLCentrella, PAMataruse, SSkinner, SRClark, MACuozzo, JWEvindar, G Discovery of a Potent Class of PI3Ka Inhibitors with Unique Binding Mode via Encoded Library Technology (ELT). ACS Med Chem Lett 6:531-6 (2015)  
Target
Name:
Phosphatidylinositol 4,5-bisphosphate 3-kinase catalytic subunit alpha isoform
Synonyms:
P42336 PI3-kinase subunit p110-alpha PIK3CA Phosphatidylinositol 3-kinase alpha (PI3Kalpha) Phosphatidylinositol 4,5-bisphosphate 3-kinase (PI3K) Phosphatidylinositol 4,5-bisphosphate 3-kinase catalytic subunit alpha (PI3Kalpha) Phosphatidylinositol 4,5-bisphosphate 3-kinase catalytic subunit alpha isoform (PI3-Ka) Phosphatidylinositol 4,5-bisphosphate 3-kinase catalytic subunit alpha isoform (PI3K p110alpha) Phosphatidylinositol 4,5-bisphosphate 3-kinase catalytic subunit alpha isoform (PI3K-alpha) Phosphatidylinositol 4,5-bisphosphate 3-kinase catalytic subunit alpha isoform (PI3Kalpha p110alpha) Phosphatidylinositol 4,5-bisphosphate 3-kinase catalytic subunit alpha isoform (PIK3CA) Phosphatidylinositol-4,5-bisphosphate 3-kinase catalytic subunit alpha isoform Phosphoinositide 3-Kinase (PI3K), alpha Chain A Phosphoinositide 3-kinases (PI3K) PtdIns-3-kinase p110 | p110 alpha
Type:
Enzyme Subunit
Mol. Mass.:
124294.87
Organism:
Homo sapiens (Human)
Description:
P42336
Residue:
1068
  
Inhibitor
Name:
BDBM50091695
Synonyms:
CHEMBL3582350
Type:
Small organic molecule
Emp. Form.:
C31H29FN6O4S2
Mol. Mass.:
632.728
SMILES:
COc1ccc(cn1)-c1cc(CNc2ccc(cc2)S(=O)(=O)Nc2nnc(C)s2)cc(c1)C(=O)NCCc1ccccc1F
: