Target
NT-3 growth factor receptor
Ligand
BDBM50092082
Substrate
Meas. Tech.
ChEMBL_1498687 (CHEMBL3582856)
IC50
<1.000000±n/a nM
Citation
 Choi, HSRucker, PVWang, ZFan, YAlbaugh, PChopiuk, GGessier, FSun, FAdrian, FLiu, GHood, TLi, NJia, YChe, JMcCormack, SLi, ALi, JSteffy, ACulazzo, ATompkins, CPhung, VKreusch, ALu, MHu, BChaudhary, APrashad, MTuntland, TLiu, BHarris, JSeidel, HMLoren, JMolteni, V (R)-2-Phenylpyrrolidine Substituted Imidazopyridazines: A New Class of Potent and Selective Pan-TRK Inhibitors. ACS Med Chem Lett 6:562-7 (2015)  
Target
Name:
NT-3 growth factor receptor
Synonyms:
GP145-TrkC NTRK3_HUMAN Neurotrophic tyrosine kinase receptor type 3 Trk-C Tyrosine kinase receptor C (Trk-C)
Type:
Enzyme
Mol. Mass.:
94428.15
Organism:
Homo sapiens (Human)
Description:
Q16288
Residue:
839
  
Inhibitor
Name:
BDBM50092082
Synonyms:
CHEMBL3582441
Type:
Small organic molecule
Emp. Form.:
C27H28FN7O2
Mol. Mass.:
501.5553
SMILES:
OC(=O)CN1CCN(CC1)c1cc(ccn1)-c1cnc2ccc(nn12)N1CCC[C@@H]1c1cccc(F)c1
: