Target
Fibroblast growth factor receptor 3
Ligand
BDBM50092079
Substrate
Meas. Tech.
ChEMBL_1498710 (CHEMBL3583123)
IC50
9500±n/a nM
Citation
 Choi, HSRucker, PVWang, ZFan, YAlbaugh, PChopiuk, GGessier, FSun, FAdrian, FLiu, GHood, TLi, NJia, YChe, JMcCormack, SLi, ALi, JSteffy, ACulazzo, ATompkins, CPhung, VKreusch, ALu, MHu, BChaudhary, APrashad, MTuntland, TLiu, BHarris, JSeidel, HMLoren, JMolteni, V (R)-2-Phenylpyrrolidine Substituted Imidazopyridazines: A New Class of Potent and Selective Pan-TRK Inhibitors. ACS Med Chem Lett 6:562-7 (2015)  
Target
Name:
Fibroblast growth factor receptor 3
Synonyms:
CD_antigen: CD333 FGFR3 Fibroblast growth factor receptor JTK4
Type:
Protein
Mol. Mass.:
87699.57
Organism:
Homo sapiens (Human)
Description:
P22607
Residue:
806
  
Inhibitor
Name:
BDBM50092079
Synonyms:
CHEMBL3582439
Type:
Small organic molecule
Emp. Form.:
C21H18FN5
Mol. Mass.:
359.3995
SMILES:
Fc1cccc(c1)[C@H]1CCCN1c1ccc2ncc(-c3ccccn3)n2n1
: