Target
Proto-oncogene tyrosine-protein kinase receptor Ret
Ligand
BDBM50092079
Substrate
Meas. Tech.
ChEMBL_1498726 (CHEMBL3583139)
IC50
8000±n/a nM
Citation
 Choi, HSRucker, PVWang, ZFan, YAlbaugh, PChopiuk, GGessier, FSun, FAdrian, FLiu, GHood, TLi, NJia, YChe, JMcCormack, SLi, ALi, JSteffy, ACulazzo, ATompkins, CPhung, VKreusch, ALu, MHu, BChaudhary, APrashad, MTuntland, TLiu, BHarris, JSeidel, HMLoren, JMolteni, V (R)-2-Phenylpyrrolidine Substituted Imidazopyridazines: A New Class of Potent and Selective Pan-TRK Inhibitors. ACS Med Chem Lett 6:562-7 (2015)  
Target
Name:
Proto-oncogene tyrosine-protein kinase receptor Ret
Synonyms:
CDHF12 Cadherin family member 12 Proto-oncogene c-Ret RET51 Tyrosine-protein kinase Ret (RET)
Type:
Protein
Mol. Mass.:
124318.29
Organism:
Homo sapiens (Human)
Description:
P07949
Residue:
1114
  
Inhibitor
Name:
BDBM50092079
Synonyms:
CHEMBL3582439
Type:
Small organic molecule
Emp. Form.:
C21H18FN5
Mol. Mass.:
359.3995
SMILES:
Fc1cccc(c1)[C@H]1CCCN1c1ccc2ncc(-c3ccccn3)n2n1
: