Target
Insulin receptor
Ligand
BDBM50092080
Substrate
Meas. Tech.
ChEMBL_1498717 (CHEMBL3583130)
IC50
8600±n/a nM
Citation
 Choi, HSRucker, PVWang, ZFan, YAlbaugh, PChopiuk, GGessier, FSun, FAdrian, FLiu, GHood, TLi, NJia, YChe, JMcCormack, SLi, ALi, JSteffy, ACulazzo, ATompkins, CPhung, VKreusch, ALu, MHu, BChaudhary, APrashad, MTuntland, TLiu, BHarris, JSeidel, HMLoren, JMolteni, V (R)-2-Phenylpyrrolidine Substituted Imidazopyridazines: A New Class of Potent and Selective Pan-TRK Inhibitors. ACS Med Chem Lett 6:562-7 (2015)  
Target
Name:
Insulin receptor
Synonyms:
INSR INSR_HUMAN Insulin receptor beta subunit
Type:
Receptor Tyrosine Kinase
Mol. Mass.:
156322.60
Organism:
Homo sapiens (Human)
Description:
P06213
Residue:
1382
  
Inhibitor
Name:
BDBM50092080
Synonyms:
CHEMBL3582427
Type:
Small organic molecule
Emp. Form.:
C20H15N5
Mol. Mass.:
325.3666
SMILES:
N#Cc1ccc(cc1)-c1cnc2ccc(NCc3ccccc3)nn12
: