Target
Atypical chemokine receptor 3
Ligand
BDBM50092259
Substrate
Meas. Tech.
ChEMBL_1499908 (CHEMBL3583502)
IC50
>30000±n/a nM
Citation
 Oishi, SKuroyanagi, TKubo, TMontpas, NYoshikawa, YMisu, RKobayashi, YOhno, HHeveker, NFuruya, TFujii, N Development of novel CXC chemokine receptor 7 (CXCR7) ligands: selectivity switch from CXCR4 antagonists with a cyclic pentapeptide scaffold. J Med Chem 58:5218-25 (2015)  
Target
Name:
Atypical chemokine receptor 3
Synonyms:
ACKR3 C-X-C chemokine receptor type 7 CMKOR1 CXCR-7 Chemokine orphan receptor 1 G-protein coupled receptor RDC1 homolog RDC-1 | RDC1
Type:
Enzyme
Mol. Mass.:
41498.84
Organism:
Homo sapiens (Human)
Description:
P25106
Residue:
362
  
Inhibitor
Name:
BDBM50092259
Synonyms:
CHEMBL3581285
Type:
Small organic molecule
Emp. Form.:
C30H47N11O6
Mol. Mass.:
657.7643
SMILES:
[H][C@@]12CCCN1C(=O)[C@H](C)NC(=O)[C@H](CCCNC(N)=N)N(C)C(=O)[C@H](CCCNC(N)=N)NC(=O)[C@@H](Cc1ccc(O)cc1)NC2=O
: