Target
Histone-lysine N-methyltransferase 2A
Ligand
BDBM50092310
Substrate
Meas. Tech.
ChEMBL_1498198 (CHEMBL3583522)
Kd
9500±n/a nM
Citation
 Ran, XZhao, YLiu, LBai, LYang, CYZhou, BMeagher, JLChinnaswamy, KStuckey, JAWang, S Structure-Based Design of¿-Carboline Analogues as Potent and Specific BET Bromodomain Inhibitors. J Med Chem 58:4927-39 (2015)  
Target
Name:
Histone-lysine N-methyltransferase 2A
Synonyms:
ALL-1 ALL1 CXXC-type zinc finger protein 7 HRX Histone-lysine N-methyltransferase 2A KMT2A_HUMAN MLL MLL cleavage product N320 Myeloid/lymphoid or mixed-lineage leukemia Myeloid/lymphoid or mixed-lineage leukemia protein 1 TRX1 Zinc finger protein HRX p320
Type:
Protein
Mol. Mass.:
431905.67
Organism:
Homo sapiens (Human)
Description:
Q03164
Residue:
3969
  
Inhibitor
Name:
BDBM50092310
Synonyms:
CHEMBL3581661 | US9675697, Cpd. No. 23
Type:
Small organic molecule
Emp. Form.:
C24H23N5O2
Mol. Mass.:
413.4717
SMILES:
COc1cc2c(cc1-c1c(C)noc1C)[nH]c1ccnc(-c3c(C)[nH]nc3C3CC3)c21
: