Target
Cannabinoid receptor 2
Ligand
BDBM50092348
Substrate
Meas. Tech.
ChEMBL_1500631 (CHEMBL3587761)
Ki
3219±n/a nM
Citation
 Radwan, MMElSohly, MAEl-Alfy, ATAhmed, SASlade, DHusni, ASManly, SPWilson, LSeale, SCutler, SJRoss, SA Isolation and Pharmacological Evaluation of Minor Cannabinoids from High-Potency Cannabis sativa. J Nat Prod 78:1271-6 (2015)  
Target
Name:
Cannabinoid receptor 2
Synonyms:
CANNABINOID CB2 CB2 CB2B CNR2_HUMAN Cannabinoid CB2 receptor Cannabinoid receptor 2 (CB2R) | hCB2
Type:
G Protein-Coupled Receptor (GPCR)
Mol. Mass.:
39690.94
Organism:
Homo sapiens (Human)
Description:
P34972
Residue:
360
  
Inhibitor
Name:
BDBM50092348
Synonyms:
CHEMBL3586104
Type:
Small organic molecule
Emp. Form.:
C21H30O3
Mol. Mass.:
330.4611
SMILES:
[H][C@@]12C=C(C)[C@@H](O)C[C@@]1([H])C(C)(C)Oc1cc(CCCCC)cc(O)c21
: