Target
Cannabinoid receptor 1
Ligand
BDBM50092343
Substrate
Meas. Tech.
ChEMBL_1500630 (CHEMBL3587760)
Ki
47±n/a nM
Citation
 Radwan, MMElSohly, MAEl-Alfy, ATAhmed, SASlade, DHusni, ASManly, SPWilson, LSeale, SCutler, SJRoss, SA Isolation and Pharmacological Evaluation of Minor Cannabinoids from High-Potency Cannabis sativa. J Nat Prod 78:1271-6 (2015)  
Target
Name:
Cannabinoid receptor 1
Synonyms:
CANN6 CB-R CNR CNR1_HUMAN Cannabinoid receptor Cannabinoid receptor 1 (brain)
Type:
G Protein-Coupled Receptor (GPCR)
Mol. Mass.:
52868.96
Organism:
Homo sapiens (Human)
Description:
P21554
Residue:
472
  
Inhibitor
Name:
BDBM50092343
Synonyms:
CHEMBL3586110
Type:
Small organic molecule
Emp. Form.:
C24H32O6
Mol. Mass.:
416.5073
SMILES:
[H][C@@]12CCC(COC(C)=O)=C[C@@]1([H])c1c(O)c(C(O)=O)c(CCCCC)cc1OC2(C)C
: