Target
Beta-secretase 2
Ligand
BDBM50092470
Substrate
Meas. Tech.
ChEMBL_1500715 (CHEMBL3588065)
IC50
1340±n/a nM
Citation
 Winneroski, LLSchiffler, MAErickson, JAMay, PCMonk, SATimm, DEAudia, JEBeck, JPBoggs, LNBorders, ARBoyer, RDBrier, RAHudziak, KJKlimkowski, VJGarcia Losada, PMathes, BMStout, SLWatson, BMMergott, DJ Preparation and biological evaluation of conformationally constrained BACE1 inhibitors. Bioorg Med Chem 23:3260-8 (2015)  
Target
Name:
Beta-secretase 2
Synonyms:
AEPLC ASP1 Asp 1 Aspartyl protease 1 BACE2_HUMAN Beta-secretase (BACE) Beta-secretase 2 (BACE-2) Beta-site APP-cleaving enzyme 2 Memapsin-1 beta-Secretase (BACE-2)
Type:
Protein
Mol. Mass.:
56171.20
Organism:
Homo sapiens (Human)
Description:
Q9Y5Z0
Residue:
518
  
Inhibitor
Name:
BDBM50092470
Synonyms:
CHEMBL3586131
Type:
Small organic molecule
Emp. Form.:
C17H21Cl2N3O2S
Mol. Mass.:
402.339
SMILES:
Cl.[H][C@@]12COC[C@]3(CC[C@@H](C[C@]13[H])NC(=O)c1cccc(Cl)c1)N=C(N)S2
: