Target
Beta-secretase 1
Ligand
BDBM50092537
Substrate
Meas. Tech.
ChEMBL_1500865 (CHEMBL3588505)
IC50
310±n/a nM
Citation
 Nguyen, VTTo, DCTran, MHOh, SHKim, JAAli, MYWoo, MHChoi, JSMin, BS Isolation of cholinesterase andß-secretase 1 inhibiting compounds from Lycopodiella cernua. Bioorg Med Chem 23:3126-34 (2015)  
Target
Name:
Beta-secretase 1
Synonyms:
ASP2 Aspartyl protease 2 BACE1 Beta-secretase (BACE) Beta-secretase 1 (BACE 1) Beta-secretase 1 (BACE1) Beta-site amyloid precursor protein cleaving enzyme 1 Memapsin-2 beta-Secretase (BACE-1) | beta-Secretase (BACE1)
Type:
Protein
Mol. Mass.:
55755.10
Organism:
Homo sapiens (Human)
Description:
P56817
Residue:
501
  
Inhibitor
Name:
BDBM50092537
Synonyms:
CHEMBL3586204
Type:
Small organic molecule
Emp. Form.:
C37H54O9
Mol. Mass.:
642.8193
SMILES:
[H][C@@]12C[C@H](O)[C@@]3(O)C[C@]4(C)CC[C@]5([H])[C@](C)(CC[C@H](OC(=O)c6ccc(O)cc6)[C@]5(C)C(O)=O)[C@@]4([H])CC[C@]3([H])[C@@]1(C)CC[C@@H](O)[C@]2(C)CO
: