Target
Carbonic anhydrase 1
Ligand
BDBM50092601
Substrate
Meas. Tech.
ChEMBL_1500871 (CHEMBL3588511)
Ki
>10000±n/a nM
Citation
 Carradori, SMollica, ACeruso, MD'Ascenzio, MDe Monte, CChimenti, PSabia, RAkdemir, ASupuran, CT New amide derivatives of Probenecid as selective inhibitors of carbonic anhydrase IX and XII: biological evaluation and molecular modelling studies. Bioorg Med Chem 23:2975-81 (2015)  
Target
Name:
Carbonic anhydrase 1
Synonyms:
CA-I CAB Carbonate dehydratase I Carbonic anhydrase 1 (CA I) Carbonic anhydrase 1 (Recombinant CA I) Carbonic anhydrase B Carbonic anhydrase I (CA I) Carbonic anhydrase I (CAI) Carbonic anhydrase isoenzyme I (hCA I) | hCA
Type:
Enzyme
Mol. Mass.:
28873.37
Organism:
Homo sapiens (Human)
Description:
P00915
Residue:
261
  
Inhibitor
Name:
BDBM50092601
Synonyms:
CHEMBL3586215
Type:
Small organic molecule
Emp. Form.:
C20H33N3O3S
Mol. Mass.:
395.559
SMILES:
CCCN(CCC)S(=O)(=O)c1ccc(cc1)C(=O)NCCN1CCCCC1
: