Target
Carbonic anhydrase 12
Ligand
BDBM50092596
Substrate
Meas. Tech.
ChEMBL_1500874 (CHEMBL3588514)
Ki
206±n/a nM
Citation
 Carradori, SMollica, ACeruso, MD'Ascenzio, MDe Monte, CChimenti, PSabia, RAkdemir, ASupuran, CT New amide derivatives of Probenecid as selective inhibitors of carbonic anhydrase IX and XII: biological evaluation and molecular modelling studies. Bioorg Med Chem 23:2975-81 (2015)  
Target
Name:
Carbonic anhydrase 12
Synonyms:
CA-XII CAH12_HUMAN Carbonic anhydrase Carbonic anhydrase XII Carbonic anhydrase XII (CAXII) | Tumor antigen HOM-RCC-3.1.3
Type:
Enzyme
Mol. Mass.:
39456.00
Organism:
Homo sapiens (Human)
Description:
Catalytic domain of human cloned isozyme was used in the assay
Residue:
354
  
Inhibitor
Name:
BDBM50092596
Synonyms:
CHEMBL3586221
Type:
Small organic molecule
Emp. Form.:
C19H23N3O5S
Mol. Mass.:
405.468
SMILES:
CCCN(CCC)S(=O)(=O)c1ccc(cc1)C(=O)Nc1ccc(cc1)[N+]([O-])=O
: