Target
Serine/threonine-protein kinase mTOR
Ligand
BDBM50092786
Substrate
Meas. Tech.
ChEMBL_1501613 (CHEMBL3587365)
IC50
5.0±n/a nM
Citation
Target
Name:
Serine/threonine-protein kinase mTOR
Synonyms:
FK506-binding protein 12-rapamycin complex-associated protein 1 FRAP FRAP1 MTOR Mammalian Target of Rapamycin (mTOR) RAFT1 Rapamycin and FKBP12 target 1 Serine/threonine-protein kinase (mTOR) | mTORC2
Type:
Rapamycin target protein
Mol. Mass.:
288917.12
Organism:
Homo sapiens (Human)
Description:
P42345
Residue:
2549
  
Inhibitor
Name:
BDBM50092786
Synonyms:
CHEMBL3586384
Type:
Small organic molecule
Emp. Form.:
C22H25N7O2
Mol. Mass.:
419.4796
SMILES:
Cc1cc(ccc1-c1cnc2NCC(=O)N(CCC3CCOCC3)c2n1)-c1nc[nH]n1
: