Target
Orexin receptor type 2
Ligand
BDBM50097388
Substrate
Meas. Tech.
ChEMBL_1501663 (CHEMBL3587482)
Ki
9.8±n/a nM
Citation
 Letavic, MABonaventure, PCarruthers, NIDugovic, CKoudriakova, TLord, BLovenberg, TWLy, KSMani, NSNepomuceno, DPippel, DJRizzolio, MShelton, JEShah, CRShireman, BTYoung, LKYun, S Novel Octahydropyrrolo[3,4-c]pyrroles Are Selective Orexin-2 Antagonists: SAR Leading to a Clinical Candidate. J Med Chem 58:5620-36 (2015)  
Target
Name:
Orexin receptor type 2
Synonyms:
HCRTR2 OX2R_HUMAN Orexin receptor type 2 (OR-2) Orexin receptor type 2 (OX2R) Ox-2-R | Ox2-R
Type:
Protein
Mol. Mass.:
50710.53
Organism:
Homo sapiens (Human)
Description:
O43614
Residue:
444
  
Inhibitor
Name:
BDBM50097388
Synonyms:
CHEMBL3586426
Type:
Small organic molecule
Emp. Form.:
C23H24N4OS
Mol. Mass.:
404.528
SMILES:
[H][C@@]12CN(C[C@]1([H])CN(C2)c1nc(C)cc(C)n1)C(=O)c1ccccc1-c1cccs1
: