Target
Metallo-beta-lactamase L1 type 3
Ligand
BDBM50092982
Substrate
Meas. Tech.
ChEMBL_1500319 (CHEMBL3588630)
Ki
170±n/a nM
Citation
 Liu, XLShi, YKang, JSOelschlaeger, PYang, KW Amino Acid Thioester Derivatives: A Highly Promising Scaffold for the Development of Metallo-ß-lactamase L1 Inhibitors. ACS Med Chem Lett 6:660-4 (2015)  
Target
Name:
Metallo-beta-lactamase L1 type 3
Synonyms:
BLA1_STEMA | Beta-lactamase L1
Type:
PROTEIN
Mol. Mass.:
30803.13
Organism:
Stenotrophomonas maltophilia
Description:
ChEMBL_1500319
Residue:
290
  
Inhibitor
Name:
BDBM50092982
Synonyms:
CHEMBL3585360
Type:
Small organic molecule
Emp. Form.:
C19H18N2O4S2
Mol. Mass.:
402.487
SMILES:
OC(=O)CSC(=O)[C@H](Cc1c[nH]c2ccccc12)NC(=O)Cc1cccs1
: