Target
Nitric oxide synthase, brain
Ligand
BDBM50093349
Substrate
Meas. Tech.
ChEMBL_1500370 (CHEMBL3587003)
Ki
24±n/a nM
Citation
 Kang, SLi, HTang, WMartásek, PRoman, LJPoulos, TLSilverman, RB 2-Aminopyridines with a Truncated Side Chain To Improve Human Neuronal Nitric Oxide Synthase Inhibitory Potency and Selectivity. J Med Chem 58:5548-60 (2015)  
Target
Name:
Nitric oxide synthase, brain
Synonyms:
Bnos NC-NOS NOS type I nNOS Neuronal nitric oxide synthase Nitric Oxide Synthase, brain Nitric oxide synthase, brain (nNOS) Nitric-oxide synthase, brain (nNOS) Nos1 | Peptidyl-cysteine S-nitrosylase NOS1
Type:
Enzyme
Mol. Mass.:
160570.98
Organism:
Rattus norvegicus (rat)
Description:
Recombinant nNOS overexpressed in E. coli was used in enzyme assays.
Residue:
1429
  
Inhibitor
Name:
BDBM50093349
Synonyms:
CHEMBL3586664 | US9951014, Name 19c
Type:
Small organic molecule
Emp. Form.:
C19H25N5
Mol. Mass.:
323.4353
SMILES:
CNCCN(C)c1cc(CCc2cc(C)cc(N)n2)cc(c1)C#N
: