Target
Tyrosine-protein kinase JAK2
Ligand
BDBM50093351
Substrate
Meas. Tech.
ChEMBL_1500403 (CHEMBL3587036)
Ki
3200±n/a nM
Citation
 Collier, PNMessersmith, DLe Tiran, ABandarage, UKBoucher, CCome, JCottrell, KMDamagnez, VDoran, JDGriffith, JPKhare-Pandit, SKrueger, EBLedeboer, MWLedford, BLiao, YMahajan, SMoody, CSRoday, SWang, TXu, JAronov, AM Discovery of Highly Isoform Selective Thiazolopiperidine Inhibitors of Phosphoinositide 3-Kinase¿. J Med Chem 58:5684-8 (2015)  
Target
Name:
Tyrosine-protein kinase JAK2
Synonyms:
JAK-2 JAK2_HUMAN Janus kinase 2 (JAK2) | Janus kinase 2 (a protein tyrosine kinase)
Type:
Protein
Mol. Mass.:
130684.68
Organism:
Homo sapiens (Human)
Description:
O60674
Residue:
1132
  
Inhibitor
Name:
BDBM50093351
Synonyms:
CHEMBL3585362
Type:
Small organic molecule
Emp. Form.:
C20H22ClF2N7O2S
Mol. Mass.:
497.949
SMILES:
COc1cc(cnc1Cl)N1CCc2nc(NC(=O)NCCc3cn(CC(F)F)cn3)sc2C1
: