Target
Tyrosine-protein phosphatase non-receptor type 1
Ligand
BDBM50093523
Substrate
Meas. Tech.
ChEMBL_1501267 (CHEMBL3587976)
Ki
14500±n/a nM
Citation
 Nguyen, PHJi, DJHan, YRChoi, JSRhyu, DYMin, BSWoo, MH Selaginellin and biflavonoids as protein tyrosine phosphatase 1B inhibitors from Selaginella tamariscina and their glucose uptake stimulatory effects. Bioorg Med Chem 23:3730-7 (2015)  
Target
Name:
Tyrosine-protein phosphatase non-receptor type 1
Synonyms:
PTN1_HUMAN PTPN1 Protein tyrosine phosphatase-1B (PTP1B) Protein-tyrosine phosphatase 1B (PTP1B) Tyrosine-protein phosphatase non-receptor type 1 (PTP1B)
Type:
Protein phosphatase
Mol. Mass.:
49963.76
Organism:
Homo sapiens (Human)
Description:
Human recombinant GST-fusion PTP1B (1-435).
Residue:
435
  
Inhibitor
Name:
BDBM50093523
Synonyms:
CHEMBL3585679 | PTP1B spring 6 (6)
Type:
Small organic molecule
Emp. Form.:
C22H16O5
Mol. Mass.:
360.3594
SMILES:
OCc1ccc(-c2ccc(O)cc2)c(C(O)=O)c1C#Cc1ccc(O)cc1
: