Target
Acetylcholinesterase
Ligand
BDBM50093583
Substrate
Meas. Tech.
ChEMBL_1501472 (CHEMBL3588578)
IC50
0.027±n/a nM
Citation
 Akincioglu, AAkincioglu, HGülçin, IDurdagi, SSupuran, CTGöksu, S Discovery of potent carbonic anhydrase and acetylcholine esterase inhibitors: novel sulfamoylcarbamates and sulfamides derived from acetophenones. Bioorg Med Chem 23:3592-602 (2015)  
Target
Name:
Acetylcholinesterase
Synonyms:
ACES_HUMAN Acetylcholinesterase (AChE) | Acetylcholinesterase (human AChE)
Type:
Enzyme
Mol. Mass.:
67792.70
Organism:
Homo sapiens (Human)
Description:
P22303
Residue:
614
  
Inhibitor
Name:
BDBM50093583
Synonyms:
CHEMBL3585781
Type:
Small organic molecule
Emp. Form.:
C9H14N2O3S
Mol. Mass.:
230.284
SMILES:
COc1ccc(cc1)C(C)NS(N)(=O)=O
: