Target
Carbonic anhydrase 2
Ligand
BDBM50093585
Substrate
Meas. Tech.
ChEMBL_1501471 (CHEMBL3588577)
Ki
0.105±n/a nM
Citation
 Akincioglu, AAkincioglu, HGülçin, IDurdagi, SSupuran, CTGöksu, S Discovery of potent carbonic anhydrase and acetylcholine esterase inhibitors: novel sulfamoylcarbamates and sulfamides derived from acetophenones. Bioorg Med Chem 23:3592-602 (2015)  
Target
Name:
Carbonic anhydrase 2
Synonyms:
CA-II CAC Carbonate dehydratase II Carbonic anhydrase 2 (CA-II) Carbonic anhydrase C Carbonic anhydrase II (CA-II) Carbonic anhydrase II (hCA II) | Carbonic anhydrase isoenzyme II (hCA II)
Type:
Enzyme
Mol. Mass.:
29250.71
Organism:
Homo sapiens (Human)
Description:
P00918
Residue:
260
  
Inhibitor
Name:
BDBM50093585
Synonyms:
CHEMBL3585779
Type:
Small organic molecule
Emp. Form.:
C18H22N2O6S
Mol. Mass.:
394.442
SMILES:
COc1cccc(OC)c1C(C)NS(=O)(=O)NC(=O)OCc1ccccc1
: