Target
Amine oxidase [flavin-containing] A
Ligand
BDBM50097465
Substrate
Meas. Tech.
ChEMBL_1501477 (CHEMBL3586839)
IC50
39.0±n/a nM
Citation
 Khattab, SNHaiba, NSAsal, AMBekhit, AAAmer, AAbdel-Rahman, HMEl-Faham, A Synthesis and evaluation of quinazoline amino acid derivatives as mono amine oxidase (MAO) inhibitors. Bioorg Med Chem 23:3574-85 (2015)  
Target
Name:
Amine oxidase [flavin-containing] A
Synonyms:
AOFA_BOVIN MAO-A Monoamine Oxidase Type A (MAO-A) Monoamine oxidase A | Monoamine oxidase type A
Type:
PROTEIN
Mol. Mass.:
59764.63
Organism:
Bos taurus
Description:
ChEMBL_1501477
Residue:
527
  
Inhibitor
Name:
BDBM50097465
Synonyms:
CHEMBL3585816
Type:
Small organic molecule
Emp. Form.:
C18H18N2O3
Mol. Mass.:
310.3471
SMILES:
COC(=O)C(C)N1C(Nc2ccccc2C1=O)c1ccccc1
: