Target
Amine oxidase [flavin-containing] B
Ligand
BDBM50097461
Substrate
Meas. Tech.
ChEMBL_1501478 (CHEMBL3586840)
IC50
340000±n/a nM
Citation
 Khattab, SNHaiba, NSAsal, AMBekhit, AAAmer, AAbdel-Rahman, HMEl-Faham, A Synthesis and evaluation of quinazoline amino acid derivatives as mono amine oxidase (MAO) inhibitors. Bioorg Med Chem 23:3574-85 (2015)  
Target
Name:
Amine oxidase [flavin-containing] B
Synonyms:
AOFB_BOVIN MAO-B Monoamine Oxidase Type B (MAO-B) Monoamine oxidase B | Monoamine oxidase type B
Type:
PROTEIN
Mol. Mass.:
58428.94
Organism:
Bos taurus
Description:
ChEMBL_1501478
Residue:
520
  
Inhibitor
Name:
BDBM50097461
Synonyms:
CHEMBL3585819
Type:
Small organic molecule
Emp. Form.:
C22H20N2O4
Mol. Mass.:
376.4052
SMILES:
COC(=O)C(Cc1ccccc1)N1C(Nc2ccccc2C1=O)c1ccco1
: