Target
Amine oxidase [flavin-containing] B
Ligand
BDBM50097463
Substrate
Meas. Tech.
ChEMBL_1501478 (CHEMBL3586840)
IC50
88000±n/a nM
Citation
 Khattab, SNHaiba, NSAsal, AMBekhit, AAAmer, AAbdel-Rahman, HMEl-Faham, A Synthesis and evaluation of quinazoline amino acid derivatives as mono amine oxidase (MAO) inhibitors. Bioorg Med Chem 23:3574-85 (2015)  
Target
Name:
Amine oxidase [flavin-containing] B
Synonyms:
AOFB_BOVIN MAO-B Monoamine Oxidase Type B (MAO-B) Monoamine oxidase B | Monoamine oxidase type B
Type:
PROTEIN
Mol. Mass.:
58428.94
Organism:
Bos taurus
Description:
ChEMBL_1501478
Residue:
520
  
Inhibitor
Name:
BDBM50097463
Synonyms:
CHEMBL3585814
Type:
Small organic molecule
Emp. Form.:
C17H15ClN2O3
Mol. Mass.:
330.766
SMILES:
COC(=O)CN1C(Nc2ccccc2C1=O)c1ccc(Cl)cc1
: