Target
Growth hormone secretagogue receptor type 1
Ligand
BDBM50094232
Substrate
Meas. Tech.
ChEMBL_1500300 (CHEMBL3588724)
IC50
36±n/a nM
Citation
 Takahashi, BFunami, HIwaki, TMaruoka, HNagahira, AKoyama, MKamiide, YMatsuo, TMuto, TAnnoura, H 2-Aminoalkyl nicotinamide derivatives as pure inverse agonists of the ghrelin receptor. Bioorg Med Chem Lett 25:2707-12 (2015)  
Target
Name:
Growth hormone secretagogue receptor type 1
Synonyms:
GH-releasing peptide receptor GHS-R GHSR_HUMAN Ghrelin receptor | Ghrelin receptor 1a (GHS-R1a)
Type:
Receptor
Mol. Mass.:
41334.57
Organism:
Homo sapiens (Human)
Description:
Receptor binding studies use plasma membranes from LLC PK-1 cells transiently transfected with hGHSR1a.
Residue:
366
  
Inhibitor
Name:
BDBM50094232
Synonyms:
CHEMBL3586024
Type:
Small organic molecule
Emp. Form.:
C29H29N5O5
Mol. Mass.:
527.5711
SMILES:
CCCn1cc(cn1)-c1cnc(NCc2ccc3OCOc3c2)c(c1)C(=O)NCC1COc2ccccc2O1
: