Target
Catenin beta-1
Ligand
BDBM50094590
Substrate
Meas. Tech.
ChEMBL_1504364 (CHEMBL3592701)
Ki
5800±n/a nM
Citation
 Catrow, JLZhang, YZhang, MJi, H Discovery of Selective Small-Molecule Inhibitors for the฿-Catenin/T-Cell Factor Protein-Protein Interaction through the Optimization of the Acyl Hydrazone Moiety. J Med Chem 58:4678-92 (2015)  
Target
Name:
Catenin beta-1
Synonyms:
CTNB1_HUMAN CTNNB1
Type:
PROTEIN
Mol. Mass.:
85484.08
Organism:
Homo sapiens (Human)
Description:
ChEMBL_1504364
Residue:
781
  
Inhibitor
Name:
BDBM50094590
Synonyms:
CHEMBL3589012
Type:
Small organic molecule
Emp. Form.:
C14H7N9O3
Mol. Mass.:
349.2639
SMILES:
Nc1nonc1C(=O)N\N=C1\c2ccccc2-c2nc3nonc3nc12
: