Target
Catenin beta-1
Ligand
BDBM50094597
Substrate
Meas. Tech.
ChEMBL_1504364 (CHEMBL3592701)
Ki
77000±n/a nM
Citation
 Catrow, JLZhang, YZhang, MJi, H Discovery of Selective Small-Molecule Inhibitors for the฿-Catenin/T-Cell Factor Protein-Protein Interaction through the Optimization of the Acyl Hydrazone Moiety. J Med Chem 58:4678-92 (2015)  
Target
Name:
Catenin beta-1
Synonyms:
CTNB1_HUMAN CTNNB1
Type:
PROTEIN
Mol. Mass.:
85484.08
Organism:
Homo sapiens (Human)
Description:
ChEMBL_1504364
Residue:
781
  
Inhibitor
Name:
BDBM50094597
Synonyms:
CHEMBL2323028
Type:
Small organic molecule
Emp. Form.:
C16H10ClNO4
Mol. Mass.:
315.708
SMILES:
OC(=O)c1cc(on1)-c1ccc(Oc2ccc(Cl)cc2)cc1
: