Target
Non-receptor tyrosine-protein kinase TYK2
Ligand
BDBM50094660
Substrate
Meas. Tech.
ChEMBL_1504399 (CHEMBL3592852)
IC50
16±n/a nM
Citation
 Zimmermann, KSang, XMastalerz, HAJohnson, WLZhang, GLiu, QBatt, DLombardo, LJVyas, DTrainor, GLTokarski, JSLorenzi, MVYou, DGottardis, MMLippy, JKhan, JSack, JSPurandare, AV 9H-Carbazole-1-carboxamides as potent and selective JAK2 inhibitors. Bioorg Med Chem Lett 25:2809-12 (2015)  
Target
Name:
Non-receptor tyrosine-protein kinase TYK2
Synonyms:
Non-receptor tyrosine-protein kinase TYK2 (TYK2) TYK2_HUMAN | Tyrosine-protein kinase TYK2
Type:
Protein
Mol. Mass.:
133666.03
Organism:
Homo sapiens (Human)
Description:
P29597
Residue:
1187
  
Inhibitor
Name:
BDBM50094660
Synonyms:
CHEMBL3589165
Type:
Small organic molecule
Emp. Form.:
C24H21N3O3
Mol. Mass.:
399.4418
SMILES:
NC(=O)c1cc(cc2c1[nH]c1ccc(cc21)C(=O)N1CCOCC1)-c1ccccc1
: