Target
Bromodomain-containing protein 4
Ligand
BDBM50094894
Substrate
Meas. Tech.
ChEMBL_1502939 (CHEMBL3591776)
IC50
26000±n/a nM
Citation
 Duffy, BCLiu, SMartin, GSWang, RHsia, MMZhao, HGuo, CEllis, MQuinn, JFKharenko, OANorek, KGesner, EMYoung, PRMcLure, KGWagner, GSLakshminarasimhan, DWhite, ASuto, RKHansen, HCKitchen, DB Discovery of a new chemical series of BRD4(1) inhibitors using protein-ligand docking and structure-guided design. Bioorg Med Chem Lett 25:2818-23 (2015)  
Target
Name:
Bromodomain-containing protein 4
Synonyms:
BRD4 Bromodomain-containing protein 4 (BRD4) Protein HUNK1
Type:
Protein
Mol. Mass.:
152264.84
Organism:
Homo sapiens (Human)
Description:
O60885
Residue:
1362
  
Inhibitor
Name:
BDBM50094894
Synonyms:
CHEMBL3589485
Type:
Small organic molecule
Emp. Form.:
C20H15N3O2
Mol. Mass.:
329.352
SMILES:
O=C(N1CC(=O)Nc2ccccc12)c1cncc(c1)-c1ccccc1
: