Target
Poly [ADP-ribose] polymerase tankyrase-2
Ligand
BDBM50094927
Substrate
Meas. Tech.
ChEMBL_1502964 (CHEMBL3591898)
IC50
7.5±n/a nM
Citation
 Kumpan, KNathubhai, AZhang, CWood, PJLloyd, MDThompson, ASHaikarainen, TLehtiö, LThreadgill, MD Structure-based design, synthesis and evaluation in vitro of arylnaphthyridinones, arylpyridopyrimidinones and their tetrahydro derivatives as inhibitors of the tankyrases. Bioorg Med Chem 23:3013-32 (2015)  
Target
Name:
Poly [ADP-ribose] polymerase tankyrase-2
Synonyms:
(ARTD6 or PARP5b) Poly [ADP-ribose] polymerase tankyrase-2 TNKL TNKS2_HUMAN Tankyrase 2 Tankyrase-2 Tankyrase-2 (TNKS2)
Type:
Enzyme
Mol. Mass.:
126937.16
Organism:
Homo sapiens (Human)
Description:
Q9H2K2
Residue:
1166
  
Inhibitor
Name:
BDBM50094927
Synonyms:
CHEMBL3589283
Type:
Small organic molecule
Emp. Form.:
C16H15F3N2O
Mol. Mass.:
308.2983
SMILES:
CN1CCCc2c1cc([nH]c2=O)-c1ccc(cc1)C(F)(F)F
: