Target
Androgen receptor
Ligand
BDBM50094957
Substrate
Meas. Tech.
ChEMBL_1503067 (CHEMBL3592213)
Ki
43±n/a nM
Citation
 Ivachtchenko, AVIvanenkov, YAMitkin, ODVorobiev, AAKuznetsova, IVShevkun, NAKoryakova, AGKarapetian, RNTrifelenkov, ASKravchenko, DVVeselov, MSChufarova, NV Design, synthesis and biological evaluation of novel 5-oxo-2-thioxoimidazolidine derivatives as potent androgen receptor antagonists. Eur J Med Chem 99:51-66 (2015)  
Target
Name:
Androgen receptor
Synonyms:
ANDR_HUMAN Androgen Receptor Androgen receptor/Baculoviral IAP repeat-containing protein 2 Dihydrotestosterone receptor Nuclear receptor subfamily 3 group C member 4
Type:
Receptor
Mol. Mass.:
99185.27
Organism:
Homo sapiens (Human)
Description:
CHO cells were stably transfected with human AR gene.
Residue:
920
  
Inhibitor
Name:
BDBM50094957
Synonyms:
CHEMBL3588965
Type:
Small organic molecule
Emp. Form.:
C21H16F4N4O3S
Mol. Mass.:
480.435
SMILES:
CNC(=O)c1ccc(cc1F)N1C(=S)N(C(=O)C1(C)CO)c1ccc(C#N)c(c1)C(F)(F)F
: