Target
Vesicular acetylcholine transporter
Ligand
BDBM50095018
Substrate
Meas. Tech.
ChEMBL_1503354 (CHEMBL3590745)
Ki
60±n/a nM
Citation
 Barthel, CSorger, DDeuther-Conrad, WScheunemann, MSchweiger, SJäckel, PRoghani, ASteinbach, JSchüürmann, GSabri, OBrust, PWenzel, B New systematically modified vesamicol analogs and their affinity and selectivity for the vesicular acetylcholine transporter - A critical examination of the lead structure. Eur J Med Chem 100:50-67 (2015)  
Target
Name:
Vesicular acetylcholine transporter
Synonyms:
Slc18a3 VACHT_RAT Vat | rVAT
Type:
PROTEIN
Mol. Mass.:
56533.41
Organism:
Rattus norvegicus
Description:
ChEMBL_1503353
Residue:
530
  
Inhibitor
Name:
BDBM50095018
Synonyms:
CHEMBL3589725
Type:
Small organic molecule
Emp. Form.:
C20H30FNO2
Mol. Mass.:
335.4561
SMILES:
O[C@@H]1C[C@H](CC[C@H]1N1CCC(CC1)c1ccccc1)OCCCF
: