Target
Sterol carrier protein 2
Ligand
BDBM50356199
Substrate
Meas. Tech.
ChEMBL_1503504 (CHEMBL3591434)
EC50
5000±n/a nM
Citation
 da Silva, JBNavarro, DMda Silva, AGSantos, GKDutra, KAMoreira, DRRamos, MNEspíndola, JWde Oliveira, ADBrondani, DJLeite, ACHernandes, MZPereira, VRda Rocha, LFde Castro, MCde Oliveira, BCLan, QMerz, KM Thiosemicarbazones as Aedes aegypti larvicidal. Eur J Med Chem 100:162-75 (2015)  
Target
Name:
Sterol carrier protein 2
Synonyms:
SCP-2 Sterol carrier protein-2
Type:
PROTEIN
Mol. Mass.:
12267.58
Organism:
Aedes aegypti
Description:
ChEMBL_109822
Residue:
110
  
Inhibitor
Name:
BDBM50356199
Synonyms:
CHEMBL242113
Type:
Small organic molecule
Emp. Form.:
C8H9N3OS
Mol. Mass.:
195.242
SMILES:
NC(=S)NN=Cc1ccc(O)cc1
: