Target
Inhibin beta A chain
Ligand
BDBM50095125
Substrate
Meas. Tech.
ChEMBL_1503623 (CHEMBL3591943)
IC50
4420±n/a nM
Citation
 Zhu, JMishra, RKSchiltz, GEMakanji, YScheidt, KAMazar, APWoodruff, TK Virtual High-Throughput Screening To Identify Novel Activin Antagonists. J Med Chem 58:5637-48 (2015)  
Target
Name:
Inhibin beta A chain
Synonyms:
Activin beta-A chain Inhba | Inhibin beta A chain
Type:
PROTEIN
Mol. Mass.:
47403.32
Organism:
Mus musculus
Description:
ChEMBL_109823
Residue:
424
  
Inhibitor
Name:
BDBM50095125
Synonyms:
CHEMBL3589511
Type:
Small organic molecule
Emp. Form.:
C22H32N2O3S
Mol. Mass.:
404.566
SMILES:
CC(C)(O)C#Cc1ccc(CN2CCC[C@@H](CCC(=O)N3CCOCC3)C2)s1
: