Target
Inhibin beta A chain
Ligand
BDBM50095142
Substrate
Meas. Tech.
ChEMBL_1503623 (CHEMBL3591943)
IC50
>100000±n/a nM
Citation
 Zhu, JMishra, RKSchiltz, GEMakanji, YScheidt, KAMazar, APWoodruff, TK Virtual High-Throughput Screening To Identify Novel Activin Antagonists. J Med Chem 58:5637-48 (2015)  
Target
Name:
Inhibin beta A chain
Synonyms:
Activin beta-A chain Inhba | Inhibin beta A chain
Type:
PROTEIN
Mol. Mass.:
47403.32
Organism:
Mus musculus
Description:
ChEMBL_109823
Residue:
424
  
Inhibitor
Name:
BDBM50095142
Synonyms:
CHEMBL1388300
Type:
Small organic molecule
Emp. Form.:
C20H18N4O5
Mol. Mass.:
394.3807
SMILES:
Cc1n[nH]c(O)c1C(c1ccc(o1)-c1ccccc1C(O)=O)c1c(C)n[nH]c1O
: