Target
Sodium channel protein type 2 subunit alpha
Ligand
BDBM50031299
Substrate
Meas. Tech.
ChEMBL_1503944 (CHEMBL3590773)
IC50
17000±n/a nM
Citation
 Bagal, SKBungay, PJDenton, SMGibson, KRGlossop, MSHay, TLKemp, MILane, CALewis, MLMaw, GNMillion, WAPayne, CEPoinsard, CRawson, DJStammen, BLStevens, EBThompson, LR Discovery and Optimization of Selective Nav1.8 Modulator Series That Demonstrate Efficacy in Preclinical Models of Pain. ACS Med Chem Lett 6:650-4 (2015)  
Target
Name:
Sodium channel protein type 2 subunit alpha
Synonyms:
HBSC II SCN2A SCN2A2 Sodium (Site 2) Sodium channel protein type 2 alpha subunit Voltage-gated sodium channel subunit alpha Nav1.2
Type:
Enzyme
Mol. Mass.:
227954.68
Organism:
Homo sapiens (Human)
Description:
Q99250
Residue:
2005
  
Inhibitor
Name:
BDBM50031299
Synonyms:
6-(2,3-Dichloro-phenyl)-[1,2,4]triazine-3,5-diamine 6-(2,3-dichlorophenyl)-1,2,4-triazine-3,5-diamine CHEMBL741 Lamictal | Lamictal cd
Type:
Small organic molecule
Emp. Form.:
C9H7Cl2N5
Mol. Mass.:
256.091
SMILES:
Nc1nnc(c(N)n1)-c1cccc(Cl)c1Cl
: