Target
Protein arginine N-methyltransferase 8
Ligand
BDBM50095434
Substrate
Meas. Tech.
ChEMBL_1504109 (CHEMBL3591483)
IC50
67±n/a nM
Citation
 Mitchell, LHDrew, AERibich, SARioux, NSwinger, KKJacques, SLLingaraj, TBoriack-Sjodin, PAWaters, NJWigle, TJMoradei, OJin, LRiera, TPorter-Scott, MMoyer, MPSmith, JJChesworth, RCopeland, RA Aryl Pyrazoles as Potent Inhibitors of Arginine Methyltransferases: Identification of the First PRMT6 Tool Compound. ACS Med Chem Lett 6:655-9 (2015)  
Target
Name:
Protein arginine N-methyltransferase 8
Synonyms:
ANM8_HUMAN HRMT1L3 Heterogeneous nuclear ribonucleoprotein methyltransferase-like protein 4 Protein arginine N-methyltransferase 8 Protein arginine methyltransferase 8 (PRMT8)
Type:
Protein
Mol. Mass.:
45293.70
Organism:
Homo sapiens (Human)
Description:
Residue:
394
  
Inhibitor
Name:
BDBM50095434
Synonyms:
CHEMBL3589912
Type:
Small organic molecule
Emp. Form.:
C13H17FN4
Mol. Mass.:
248.2993
SMILES:
CN(CCN)Cc1cn[nH]c1-c1ccc(F)cc1
: