Target
Lysine-specific demethylase 4C
Ligand
BDBM50095443
Substrate
Meas. Tech.
ChEMBL_1504145 (CHEMBL3591677)
IC50
55000±n/a nM
Citation
 Itoh, YSawada, HSuzuki, MTojo, TSasaki, RHasegawa, MMizukami, TSuzuki, T Identification of Jumonji AT-Rich Interactive Domain 1A Inhibitors and Their Effect on Cancer Cells. ACS Med Chem Lett 6:665-70 (2015)  
Target
Name:
Lysine-specific demethylase 4C
Synonyms:
GASC-1 protein Gene amplified in squamous cell carcinoma 1 protein JMJD2C Jumonji domain-containing protein 2C KDM4C_HUMAN | KIAA0780
Type:
Protein
Mol. Mass.:
119979.01
Organism:
Homo sapiens (Human)
Description:
Q9H3R0
Residue:
1056
  
Inhibitor
Name:
BDBM50095443
Synonyms:
CHEMBL3590418
Type:
Small organic molecule
Emp. Form.:
C13H26N2O4
Mol. Mass.:
274.3565
SMILES:
CCCCN(C)CCCCC(=O)N(O)CCC(O)=O
: