Target
Potassium voltage-gated channel subfamily H member 2
Ligand
BDBM50095832
Substrate
Meas. Tech.
ChEMBL_1504611 (CHEMBL3591516)
Kd
105±n/a nM
Citation
 Yu, Zvan Veldhoven, JPLouvel, J't Hart, IMRook, MBvan der Heyden, MAHeitman, LHIJzerman, AP Structure-Affinity Relationships (SARs) and Structure-Kinetics Relationships (SKRs) of Kv11.1 Blockers. J Med Chem 58:5916-29 (2015)  
Target
Name:
Potassium voltage-gated channel subfamily H member 2
Synonyms:
1,3-beta-glucan synthase component GLS2 ERG Eag-related protein 1 Ether-a-go-go-related gene (HERG) Ether-a-go-go-related gene potassium channel 1 Ether-a-go-go-related gene potassium channel 1 (hERG1) Ether-a-go-go-related protein 1 H-ERG KCNH2 Potassium voltage-gated channel subfamily H member 2 (hERG) Voltage-gated potassium channel subunit Kv11.1 hERG Potassium Channel 1 | putative potassium channel subunit
Type:
Multi-pass membrane protein
Mol. Mass.:
126672.65
Organism:
Homo sapiens (Human)
Description:
Q12809
Residue:
1159
  
Inhibitor
Name:
BDBM50095832
Synonyms:
CHEMBL3590499
Type:
Small organic molecule
Emp. Form.:
C37H28F3NO5S
Mol. Mass.:
655.682
SMILES:
[O-]S(=O)(=O)C(F)(F)F.COc1ccc(cc1)-c1ccc(cc1)C#Cc1cccc(C#Cc2ccc(cc2)-c2ccc(OC)cc2)[n+]1C
: