Target
Peptidyl-prolyl cis-trans isomerase NIMA-interacting 1
Ligand
BDBM50095906
Substrate
Meas. Tech.
ChEMBL_1502595 (CHEMBL3592735)
Kd
620±n/a nM
Citation
 Jiang, BPei, D A Selective, Cell-Permeable Nonphosphorylated Bicyclic Peptidyl Inhibitor against Peptidyl-Prolyl Isomerase Pin1. J Med Chem 58:6306-12 (2015)  
Target
Name:
Peptidyl-prolyl cis-trans isomerase NIMA-interacting 1
Synonyms:
PIN1 PPIase Pin1 | Peptidyl-prolyl cis-trans isomerase NIMA-interacting 1
Type:
PROTEIN
Mol. Mass.:
18248.11
Organism:
Homo sapiens (Human)
Description:
ChEMBL_1502595
Residue:
163
  
Inhibitor
Name:
BDBM50095906
Synonyms:
CHEMBL3590309
Type:
Small organic molecule
Emp. Form.:
C108H153N35O22
Mol. Mass.:
2293.5917
SMILES:
[H][C@]12CCCCN1C(=O)[C@]([H])(NC(=O)CN(C)C(=O)[C@@H](C)NC(=O)c1cc3cc(c1)C(=O)NC[C@]([H])(NC(=O)[C@@H](C)NC(=O)[C@H](C)NC(=O)[C@H](CCCNC(N)=N)NC(=O)[C@H](Cc1ccc4ccccc4c1)NC2=O)C(=O)N[C@@H](Cc1ccccc1)C(=O)N[C@@H](Cc1ccc2ccccc2c1)C(=O)N[C@@H](CCCNC(N)=N)C(=O)N[C@@H](CCCNC(N)=N)C(=O)N[C@@H](CCCNC(N)=N)C(=O)N[C@@H](CCCNC(N)=N)C(=O)N[C@@H](CNC3=O)C(=O)N[C@@H](CCCCN)C(O)=O)[C@H](C)O
: