Target
Dihydroorotate dehydrogenase (quinone), mitochondrial
Ligand
BDBM50096196
Substrate
Meas. Tech.
ChEMBL_1505693 (CHEMBL3594613)
IC50
1380±n/a nM
Citation
 Abdullah, IChee, CFLee, YKThunuguntla, SSSatish Reddy, KNellore, KAntony, TVerma, JMun, KWOthman, SSubramanya, HRahman, NA Benzimidazole derivatives as potential dual inhibitors for PARP-1 and DHODH. Bioorg Med Chem 23:4669-80 (2015)  
Target
Name:
Dihydroorotate dehydrogenase (quinone), mitochondrial
Synonyms:
DHODH Dihydroorotate dehydrogenase Dihydroorotate dehydrogenase, mitochondrial Dihydroorotate oxidase (DHODH) | PYRD_HUMAN
Type:
Enzyme
Mol. Mass.:
42881.33
Organism:
Homo sapiens (Human)
Description:
Q02127
Residue:
395
  
Inhibitor
Name:
BDBM50096196
Synonyms:
CHEMBL3593802
Type:
Small organic molecule
Emp. Form.:
C23H19N3O3
Mol. Mass.:
385.4153
SMILES:
CC(=O)Nc1cccc(c1)-c1ccc(cc1)-c1nc2c(cc(C)cc2[nH]1)C(O)=O
: