Target
Growth hormone secretagogue receptor type 1
Ligand
BDBM50096217
Substrate
Meas. Tech.
ChEMBL_1505779 (CHEMBL3595017)
IC50
47±n/a nM
Citation
 Takahashi, BFunami, HIwaki, TMaruoka, HShibata, MKoyama, MNagahira, AKamiide, YKanki, SIgawa, YMuto, T Orally active ghrelin receptor inverse agonists and their actions on a rat obesity model. Bioorg Med Chem 23:4792-803 (2015)  
Target
Name:
Growth hormone secretagogue receptor type 1
Synonyms:
GH-releasing peptide receptor GHS-R Ghrelin receptor Growth hormone secretagogue receptor type 1
Type:
PROTEIN
Mol. Mass.:
40970.19
Organism:
Rattus norvegicus
Description:
ChEMBL_11556
Residue:
364
  
Inhibitor
Name:
BDBM50096217
Synonyms:
CHEMBL3593632
Type:
Small organic molecule
Emp. Form.:
C34H36N4O5
Mol. Mass.:
580.6734
SMILES:
[H][C@]12CC[C@]([H])(CC(=C1)c1cnc(NCc3ccc4CCOc4c3)c(c1)C(=O)NC[C@H]1COc3ccccc3O1)N(C2)C(C)=O
: