Target
Growth hormone secretagogue receptor type 1
Ligand
BDBM50096215
Substrate
Meas. Tech.
ChEMBL_1505779 (CHEMBL3595017)
IC50
5.4±n/a nM
Citation
 Takahashi, BFunami, HIwaki, TMaruoka, HShibata, MKoyama, MNagahira, AKamiide, YKanki, SIgawa, YMuto, T Orally active ghrelin receptor inverse agonists and their actions on a rat obesity model. Bioorg Med Chem 23:4792-803 (2015)  
Target
Name:
Growth hormone secretagogue receptor type 1
Synonyms:
GH-releasing peptide receptor GHS-R Ghrelin receptor Growth hormone secretagogue receptor type 1
Type:
PROTEIN
Mol. Mass.:
40970.19
Organism:
Rattus norvegicus
Description:
ChEMBL_11556
Residue:
364
  
Inhibitor
Name:
BDBM50096215
Synonyms:
CHEMBL3593815
Type:
Small organic molecule
Emp. Form.:
C28H27F2N3O4
Mol. Mass.:
507.5285
SMILES:
Cc1ccc(CNC(=O)c2cc(cnc2NCc2ccc3OCOc3c2)C#CC(C)(C)O)cc1C(F)F
: