Target
Serine/threonine-protein kinase PAK 1
Ligand
BDBM50096237
Substrate
Meas. Tech.
ChEMBL_1505869 (CHEMBL3595326)
Ki
111±n/a nM
Citation
 Rudolph, JAliagas, ICrawford, JJMathieu, SLee, WChao, QDong, PRouge, LWang, WHeise, CMurray, LJLa, HLiu, YManning, GDiederich, FHoeflich, KP Leveraging the Pre-DFG Residue Thr-406 To Obtain High Kinase Selectivity in an Aminopyrazole-Type PAK1 Inhibitor Series. ACS Med Chem Lett 6:711-5 (2015)  
Target
Name:
Serine/threonine-protein kinase PAK 1
Synonyms:
2.7.11.1 Cell division control protein 42 homolog PAK-1 PAK1_HUMAN p21-activated kinase 1 | p65-PAK
Type:
Mol. Mass.:
60640.15
Organism:
Homo sapiens (Human)
Description:
Q13153
Residue:
545
  
Inhibitor
Name:
BDBM50096237
Synonyms:
CHEMBL3594176
Type:
Small organic molecule
Emp. Form.:
C19H28N8O
Mol. Mass.:
384.4786
SMILES:
CN1CC[C@@H](C1=O)c1cc(Nc2ccnc(NC[C@H]3CC[C@H](N)CC3)n2)n[nH]1
: