Target
Sodium/potassium-transporting ATPase subunit alpha-1
Ligand
BDBM50096254
Substrate
Meas. Tech.
ChEMBL_1506103 (CHEMBL3595969)
IC50
570±n/a nM
Citation
 Alves, SLPaixão, NFerreira, LGSantos, FRNeves, LDOliveira, GCCortes, VFSalomé, KSBarison, ASantos, FVCenzi, GVarotti, FPOliveira, SMTaranto, AGComar, MSilva, LMNoël, FQuintas, LEBarbosa, LAVillar, JA ¿-Benzylidene digoxin derivatives synthesis and molecular modeling: Evaluation of anticancer and the Na,K-ATPase activity effect. Bioorg Med Chem 23:4397-404 (2015)  
Target
Name:
Sodium/potassium-transporting ATPase subunit alpha-1
Synonyms:
AT1A1_HUMAN Na(+)/K(+) ATPase alpha-1 subunit Sodium pump subunit alpha-1 | Sodium/potassium-transporting ATPase subunit alpha-1
Type:
Enzyme
Mol. Mass.:
112879.20
Organism:
Homo sapiens (Human)
Description:
P05023
Residue:
1023
  
Inhibitor
Name:
BDBM50096254
Synonyms:
CHEMBL3594276
Type:
Small organic molecule
Emp. Form.:
C49H70O15
Mol. Mass.:
899.0711
SMILES:
[H][C@@]1(C[C@H](O)[C@H](O[C@@]2([H])C[C@H](O)[C@H](O[C@@]3([H])C[C@H](O)[C@H](O)[C@@H](C)O3)[C@@H](C)O2)[C@@H](C)O1)O[C@H]1CC[C@@]2(C)[C@]([H])(CC[C@]3([H])[C@]2([H])C[C@@H](O)[C@]2(C)[C@H](CC[C@]32O)C2=CC(=O)O\C2=C/c2ccc(OC)cc2)C1
: