Target
Neuronal acetylcholine receptor subunit alpha-7
Ligand
BDBM50088438
Substrate
Meas. Tech.
ChEMBL_1504725 (CHEMBL3594930)
IC50
190±n/a nM
Citation
 Tomassoli, IGündisch, D The twin drug approach for novel nicotinic acetylcholine receptor ligands. Bioorg Med Chem 23:4375-89 (2015)  
Target
Name:
Neuronal acetylcholine receptor subunit alpha-7
Synonyms:
ACHA7_RAT Cholinergic, Nicotinic Alpha7 Chrna7 Neuronal acetylcholine receptor (alpha7 nAChR) Neuronal acetylcholine receptor subunit alpha-7 Neuronal acetylcholine receptor subunit alpha-7 (nAChR)
Type:
Enzyme
Mol. Mass.:
56502.44
Organism:
Rattus norvegicus (Rat)
Description:
Q05941
Residue:
502
  
Inhibitor
Name:
BDBM50088438
Synonyms:
1-(pyridin-3-yl)-1,4-diazepane CHEMBL71085 | NS3531, 1
Type:
Small organic molecule
Emp. Form.:
C10H15N3
Mol. Mass.:
177.2462
SMILES:
C1CNCCN(C1)c1cccnc1
: