Target
Mitogen-activated protein kinase kinase kinase kinase 5
Ligand
BDBM50096279
Substrate
Meas. Tech.
ChEMBL_1495741 (CHEMBL3578904)
IC50
970±n/a nM
Citation
 Henry, JRKaufman, MDPeng, SBAhn, YMCaldwell, TMVogeti, LTelikepalli, HLu, WPHood, MMRutkoski, TJSmith, BDVogeti, SMiller, DWise, SCChun, LZhang, XZhang, YKays, LHipskind, PAWrobleski, ADLobb, KLClay, JMCohen, JDWalgren, JLMcCann, DPatel, PClawson, DKGuo, SManglicmot, DGroshong, CLogan, CStarling, JJFlynn, DL Discovery of 1-(3,3-dimethylbutyl)-3-(2-fluoro-4-methyl-5-(7-methyl-2-(methylamino)pyrido[2,3-d]pyrimidin-6-yl)phenyl)urea (LY3009120) as a pan-RAF inhibitor with minimal paradoxical activation and activity against BRAF or RAS mutant tumor cells. J Med Chem 58:4165-79 (2015)  
Target
Name:
Mitogen-activated protein kinase kinase kinase kinase 5
Synonyms:
2.7.11.1 Kinase homologous to SPS1/STE20 MAP4K5 MEK kinase kinase 5 | MEKKK 5
Type:
PROTEIN
Mol. Mass.:
95039.51
Organism:
Homo sapiens (Human)
Description:
ChEMBL_1495741
Residue:
846
  
Inhibitor
Name:
BDBM50096279
Synonyms:
CHEMBL3577124
Type:
Small organic molecule
Emp. Form.:
C23H29FN6O
Mol. Mass.:
424.5144
SMILES:
CNc1ncc2cc(c(C)nc2n1)-c1cc(NC(=O)NCCC(C)(C)C)c(F)cc1C
: