Target
Probable G-protein coupled receptor 174
Ligand
BDBM50096349
Substrate
Meas. Tech.
ChEMBL_1495910 (CHEMBL3579721)
EC50
520±n/a nM
Citation
 Ikubo, MInoue, ANakamura, SJung, SSayama, MOtani, YUwamizu, ASuzuki, KKishi, TShuto, AIshiguro, JOkudaira, MKano, KMakide, KAoki, JOhwada, T Structure-activity relationships of lysophosphatidylserine analogs as agonists of G-protein-coupled receptors GPR34, P2Y10, and GPR174. J Med Chem 58:4204-19 (2015)  
Target
Name:
Probable G-protein coupled receptor 174
Synonyms:
GP174_HUMAN GPR174 | Probable G-protein coupled receptor 174
Type:
PROTEIN
Mol. Mass.:
38513.81
Organism:
Homo sapiens (Human)
Description:
ChEMBL_109763
Residue:
333
  
Inhibitor
Name:
BDBM50096349
Synonyms:
CHEBI:52649 | CHEMBL1742484
Type:
Small organic molecule
Emp. Form.:
C24H46NO9P
Mol. Mass.:
523.5971
SMILES:
CCCCCCCC\C=C/CCCCCCCC(=O)OC[C@@H](O)COP(O)(=O)OC[C@H](N)C(O)=O
: