Target
Probable G-protein coupled receptor 174
Ligand
BDBM50096458
Substrate
Meas. Tech.
ChEMBL_1495910 (CHEMBL3579721)
EC50
>1000±n/a nM
Citation
 Ikubo, MInoue, ANakamura, SJung, SSayama, MOtani, YUwamizu, ASuzuki, KKishi, TShuto, AIshiguro, JOkudaira, MKano, KMakide, KAoki, JOhwada, T Structure-activity relationships of lysophosphatidylserine analogs as agonists of G-protein-coupled receptors GPR34, P2Y10, and GPR174. J Med Chem 58:4204-19 (2015)  
Target
Name:
Probable G-protein coupled receptor 174
Synonyms:
GP174_HUMAN GPR174 | Probable G-protein coupled receptor 174
Type:
PROTEIN
Mol. Mass.:
38513.81
Organism:
Homo sapiens (Human)
Description:
ChEMBL_109763
Residue:
333
  
Inhibitor
Name:
BDBM50096458
Synonyms:
CHEMBL3577179
Type:
Small organic molecule
Emp. Form.:
C26H44NO9P
Mol. Mass.:
545.6026
SMILES:
CCCCCCCCCCCOc1ccccc1CCC(=O)OCCCOP(O)(=O)OC[C@H](N)C(O)=O
: