Target
Beta sliding clamp
Ligand
BDBM50096613
Substrate
Meas. Tech.
ChEMBL_1495912 (CHEMBL3579723)
IC50
208000±n/a nM
Citation
 Yin, ZWhittell, LRWang, YJergic, SMa, CLewis, PJDixon, NEBeck, JLKelso, MJOakley, AJ Bacterial Sliding Clamp Inhibitors that Mimic the Sequential Binding Mechanism of Endogenous Linear Motifs. J Med Chem 58:4693-702 (2015)  
Target
Name:
Beta sliding clamp
Synonyms:
Beta clamp DNA polymerase III subunit beta JW3678 | dnaN
Type:
PROTEIN
Mol. Mass.:
40578.60
Organism:
Escherichia coli (strain K12)
Description:
ChEMBL_109765
Residue:
366
  
Inhibitor
Name:
BDBM50096613
Synonyms:
CHEMBL3577283
Type:
Small organic molecule
Emp. Form.:
C21H26BrN3O3
Mol. Mass.:
448.353
SMILES:
OC(=O)[C@@H]1CCc2c(C1)n(CC(=O)NCC1CCNCC1)c1ccc(Br)cc21
: